Reaction Details
TargetZinc finger protein mex-5
LigandBDBM42248
Substrate/Competitorn/a
Meas. Tech.Fluorescent Polarization Homogeneous Dose Response HTS to Indentify Inhibitors of Mex-5 Binding to TCR-2
EC50 14867±n/a nM
Citation PubChem, PC Fluorescent Polarization Homogeneous Dose Response HTS to Indentify Inhibitors of Mex-5 Binding to TCR-2 PubChem Bioassay(2009)[AID]
 
Zinc finger protein mex-5
Name:Zinc finger protein mex-5
Type:Enzyme Catalytic Domain
Mol. Mass.:52832.78
Organism:Caenorhabditis elegans
Description:gi_55976631
Residue:468
BDBM42248
NameBDBM42248
Synonyms:9-(3,6-diketocyclohexa-1,4-dien-1-yl)-2-phenethyl-3,6,7,8-tetrahydropyrido[1,2-a]pyrazine-1,4-quinone 9-(3,6-dioxo-1-cyclohexa-1,4-dienyl)-2-(2-phenylethyl)-3,6,7,8-tetrahydropyrido[1,2-a]pyrazine-1,4-dione 9-[3,6-bis(oxidanylidene)cyclohexa-1,4-dien-1-yl]-2-(2-phenylethyl)-3,6,7,8-tetrahydropyrido[1,2-a]pyrazine-1,4-dione SMR000226463 | cid_998883
TypeSmall organic molecule
Emp. Form.C22H20N2O4
Mol. Mass.376.4052
SMILESO=C1CN(CCc2ccccc2)C(=O)C2=C(CCCN12)C1=CC(=O)C=CC1=O