Reaction Details
TargetZinc finger protein mex-5
LigandBDBM52489
Substrate/Competitorn/a
Meas. Tech.Fluorescent Polarization Homogeneous Dose Response HTS to Indentify Inhibitors of Mex-5 Binding to TCR-2
EC50 300000±n/a nM
Citation PubChem, PC Fluorescent Polarization Homogeneous Dose Response HTS to Indentify Inhibitors of Mex-5 Binding to TCR-2 PubChem Bioassay(2009)[AID]
 
Zinc finger protein mex-5
Name:Zinc finger protein mex-5
Type:Enzyme Catalytic Domain
Mol. Mass.:52832.78
Organism:Caenorhabditis elegans
Description:gi_55976631
Residue:468
BDBM52489
NameBDBM52489
Synonyms:6-methyl-8-nitro-3a,4,5,9b-tetrahydro-3H-cyclopenta[c]quinoline MLS000706104 cid_2873402
TypeSmall organic molecule
Emp. Form.C13H14N2O2
Mol. Mass.230.2625
SMILESCc1cc(cc2C3C=CCC3CNc12)[N+]([O-])=O