Reaction Details
TargetZinc finger protein mex-5
LigandBDBM47600
Substrate/Competitorn/a
Meas. Tech.Fluorescent Polarization Homogeneous Dose Response HTS to Indentify Inhibitors of Mex-5 Binding to TCR-2
EC50 13488±n/a nM
Citation PubChem, PC Fluorescent Polarization Homogeneous Dose Response HTS to Indentify Inhibitors of Mex-5 Binding to TCR-2 PubChem Bioassay(2009)[AID]
 
Zinc finger protein mex-5
Name:Zinc finger protein mex-5
Type:Enzyme Catalytic Domain
Mol. Mass.:52832.78
Organism:Caenorhabditis elegans
Description:gi_55976631
Residue:468
BDBM47600
NameBDBM47600
Synonyms:(E)-1-(4-bromophenyl)-3-[4-(diethylamino)phenyl]-2-propen-1-one MLS000416450 cid_5379238
TypeSmall organic molecule
Emp. Form.C19H20BrNO
Mol. Mass.358.272
SMILESCCN(CC)c1ccc(\C=C\C(=O)c2ccc(Br)cc2)cc1