Reaction Details
TargetZinc finger protein mex-5
LigandBDBM52492
Substrate/Competitorn/a
Meas. Tech.Fluorescent Polarization Homogeneous Dose Response HTS to Indentify Inhibitors of Mex-5 Binding to TCR-2
EC50 300000±n/a nM
Citation PubChem, PC Fluorescent Polarization Homogeneous Dose Response HTS to Indentify Inhibitors of Mex-5 Binding to TCR-2 PubChem Bioassay(2009)[AID]
 
Zinc finger protein mex-5
Name:Zinc finger protein mex-5
Type:Enzyme Catalytic Domain
Mol. Mass.:52832.78
Organism:Caenorhabditis elegans
Description:gi_55976631
Residue:468
BDBM52492
NameBDBM52492
Synonyms:(E)-1-(2,4-dimethoxyphenyl)-3-(3-nitro-4-piperidin-1-yl-phenyl)prop-2-en-1-one (E)-1-(2,4-dimethoxyphenyl)-3-(3-nitro-4-piperidino-phenyl)prop-2-en-1-one MLS000390406 cid_15945163
TypeSmall organic molecule
Emp. Form.C22H24N2O5
Mol. Mass.396.4364
SMILESCOc1ccc(C(=O)\C=C\c2ccc(N3CCCCC3)c(c2)[N+]([O-])=O)c(OC)c1