Reaction Details
TargetZinc finger protein mex-5
LigandBDBM52501
Substrate/Competitorn/a
Meas. Tech.Fluorescent Polarization Homogeneous Dose Response HTS to Indentify Inhibitors of Mex-5 Binding to TCR-2
EC50 300000±n/a nM
Citation PubChem, PC Fluorescent Polarization Homogeneous Dose Response HTS to Indentify Inhibitors of Mex-5 Binding to TCR-2 PubChem Bioassay(2009)[AID]
 
Zinc finger protein mex-5
Name:Zinc finger protein mex-5
Type:Enzyme Catalytic Domain
Mol. Mass.:52832.78
Organism:Caenorhabditis elegans
Description:gi_55976631
Residue:468
BDBM52501
NameBDBM52501
Synonyms:1-phenyl-6-(pyrimidin-2-ylsulfanylmethyl)-2H-pyrazolo[3,4-d]pyrimidin-4-one 1-phenyl-6-[(2-pyrimidylthio)methyl]-2H-pyrazolo[3,4-d]pyrimidin-4-one SMR000243299 | cid_701317
TypeSmall organic molecule
Emp. Form.C16H12N6OS
Mol. Mass.336.371
SMILESO=c1[nH]c(CSc2ncccn2)nc2n(ncc12)-c1ccccc1