Reaction Details
TargetZinc finger protein mex-5
LigandBDBM53091
Substrate/Competitorn/a
Meas. Tech.Fluorescent Polarization Homogeneous Dose Response HTS to Indentify Inhibitors of Mex-5 Binding to TCR-2
EC50 178591±n/a nM
Citation PubChem, PC Fluorescent Polarization Homogeneous Dose Response HTS to Indentify Inhibitors of Mex-5 Binding to TCR-2 PubChem Bioassay(2009)[AID]
 
Zinc finger protein mex-5
Name:Zinc finger protein mex-5
Type:Enzyme Catalytic Domain
Mol. Mass.:52832.78
Organism:Caenorhabditis elegans
Description:gi_55976631
Residue:468
BDBM53091
NameBDBM53091
Synonyms:(2E)-5-nitro-6-oxidanyl-2-[(2Z)-2-(3-oxidanyl-4-oxidanylidene-cyclohexa-2,5-dien-1-ylidene)ethylidene]-1H-pyrimidin-4-one (2E)-6-hydroxy-2-[(2Z)-2-(3-hydroxy-4-oxo-1-cyclohexa-2,5-dienylidene)ethylidene]-5-nitro-1H-pyrimidin-4-one 2-[(Z)-2-(3,4-Dihydroxy-phenyl)-vinyl]-6-hydroxy-5-nitro-3H-pyrimidin-4-one SMR000524347 | cid_25043520
TypeSmall organic molecule
Emp. Form.C12H9N3O6
Mol. Mass.291.2164
SMILESOc1[nH+]c(\C=C\[c-]2ccc(=O)c(O)c2)[nH]c(=O)c1[N+]([O-])=O