Reaction Details
TargetZinc finger protein mex-5
LigandBDBM46229
Substrate/Competitorn/a
Meas. Tech.Fluorescent Polarization Homogeneous Dose Response HTS to Indentify Inhibitors of Mex-5 Binding to TCR-2
EC50 18903±n/a nM
Citation PubChem, PC Fluorescent Polarization Homogeneous Dose Response HTS to Indentify Inhibitors of Mex-5 Binding to TCR-2 PubChem Bioassay(2009)[AID]
 
Zinc finger protein mex-5
Name:Zinc finger protein mex-5
Type:Enzyme Catalytic Domain
Mol. Mass.:52832.78
Organism:Caenorhabditis elegans
Description:gi_55976631
Residue:468
BDBM46229
NameBDBM46229
Synonyms:4-chloranyl-N-(3,4-dihydro-2H-thiochromen-4-yl)-3-sulfamoyl-benzamide 4-chloro-N-(3,4-dihydro-2H-1-benzothiopyran-4-yl)-3-sulfamoylbenzamide MLS-0336143.0001 | cid_16330874
TypeSmall organic molecule
Emp. Form.C16H15ClN2O3S2
Mol. Mass.382.885
SMILESNS(=O)(=O)c1cc(ccc1Cl)C(=O)NC1CCSc2ccccc12