Reaction Details
TargetPOsterior Segregation
LigandBDBM7459
Substrate/Competitorn/a
Meas. Tech.Fluorescent Polarization Homogeneous Dose Response HTS to Indentify Inhibitors of POS-1 Binding to mex-3-RNA
EC50 60374±n/a nM
Citation PubChem, PC Fluorescent Polarization Homogeneous Dose Response HTS to Indentify Inhibitors of POS-1 Binding to mex-3-RNA PubChem Bioassay(2009)[AID]
 
POsterior Segregation
Name:POsterior Segregation
Synonyms:POsterior Segregation family member (pos-1)
Type:Enzyme Catalytic Domain
Mol. Mass.:29838.90
Organism:Caenorhabditis elegans
Description:gi_17562800
Residue:264
BDBM7459
NameBDBM7459
TypeSmall organic molecule
Emp. Form.C15H10O6
Mol. Mass.286.2363
SMILESOc1cc(O)c2c(c1)oc(cc2=O)-c1ccc(O)c(O)c1