Reaction Details
TargetDual specificity protein phosphatase 6
LigandBDBM40576
Substrate/Competitorn/a
Meas. Tech.MKP-3 in vitro HTS assay
IC50 10000±n/a nM
Citation PubChem, PC MKP-3 in vitro HTS assay PubChem Bioassay(2009)[AID]
 
Dual specificity protein phosphatase 6
Name:Dual specificity protein phosphatase 6
Type:Enzyme
Mol. Mass.:42303.19
Organism:Rattus norvegicus
Description:gi_16758752
Residue:381
BDBM40576
NameBDBM40576
Synonyms:2-(2,5-Dimethyl-pyrrol-1-yl)-3-phenyl-propionic acid 2-(2,5-dimethylpyrrol-1-yl)-3-phenyl-propanoic acid 2-(2,5-dimethylpyrrol-1-yl)-3-phenylpropanoic acid SMR000010168 | cid_654761
TypeSmall organic molecule
Emp. Form.C15H17NO2
Mol. Mass.243.301
SMILESCc1ccc(C)n1C(Cc1ccccc1)C(O)=O