Reaction Details
TargetDual specificity protein phosphatase 6
LigandBDBM32047
Substrate/Competitorn/a
Meas. Tech.MKP-3 in vitro HTS assay
IC50 10000±n/a nM
Citation PubChem, PC MKP-3 in vitro HTS assay PubChem Bioassay(2009)[AID]
 
Dual specificity protein phosphatase 6
Name:Dual specificity protein phosphatase 6
Type:Enzyme
Mol. Mass.:42303.19
Organism:Rattus norvegicus
Description:gi_16758752
Residue:381
BDBM32047
NameBDBM32047
Synonyms:(5-amino-6-quinolyl)amine SMR000015817 quinoline-5,6-diamine
TypeSmall organic molecule
Emp. Form.C9H9N3
Mol. Mass.159.1879
SMILESNc1ccc2ncccc2c1N