Reaction Details
TargetDual specificity protein phosphatase 6
LigandBDBM49124
Substrate/Competitorn/a
Meas. Tech.MKP-3 in vitro HTS assay
IC50 10000±n/a nM
Citation PubChem, PC MKP-3 in vitro HTS assay PubChem Bioassay(2009)[AID]
 
Dual specificity protein phosphatase 6
Name:Dual specificity protein phosphatase 6
Type:Enzyme
Mol. Mass.:42303.19
Organism:Rattus norvegicus
Description:gi_16758752
Residue:381
BDBM49124
NameBDBM49124
Synonyms:MLS000082574 cid_665142
TypeSmall organic molecule
Emp. Form.C21H22N4O3S2
Mol. Mass.442.554
SMILESCSc1nc(N(CCO)CCO)c2sc3nc(-c4ccco4)c4CCCc4c3c2n1