Reaction Details
TargetDual specificity protein phosphatase 6
LigandBDBM53492
Substrate/Competitorn/a
Meas. Tech.MKP-3 in vitro HTS assay
IC50 10000±n/a nM
Citation PubChem, PC MKP-3 in vitro HTS assay PubChem Bioassay(2009)[AID]
 
Dual specificity protein phosphatase 6
Name:Dual specificity protein phosphatase 6
Type:Enzyme
Mol. Mass.:42303.19
Organism:Rattus norvegicus
Description:gi_16758752
Residue:381
BDBM53492
NameBDBM53492
Synonyms:6-[4-(4-fluorophenyl)piperazin-1-yl]sulfonyl-4-oxidanylidene-1H-quinoline-3-carboxylic acid 6-[4-(4-fluorophenyl)piperazino]sulfonyl-4-keto-1H-quinoline-3-carboxylic acid 6-{[4-(4-fluorophenyl)piperazin-1-yl]sulfonyl}-4-oxo-1,4-dihydroquinoline-3-carboxylic acid SMR000031249 | cid_3237353
TypeSmall organic molecule
Emp. Form.C20H18FN3O5S
Mol. Mass.431.437
SMILESOC(=O)c1cnc2ccc(cc2c1O)S(=O)(=O)N1CCN(CC1)c1ccc(F)cc1