Reaction Details
TargetDual specificity protein phosphatase 6
LigandBDBM35401
Substrate/Competitorn/a
Meas. Tech.MKP-3 in vitro HTS assay
IC50 10000±n/a nM
Citation PubChem, PC MKP-3 in vitro HTS assay PubChem Bioassay(2009)[AID]
 
Dual specificity protein phosphatase 6
Name:Dual specificity protein phosphatase 6
Type:Enzyme
Mol. Mass.:42303.19
Organism:Rattus norvegicus
Description:gi_16758752
Residue:381
BDBM35401
NameBDBM35401
Synonyms:3-hydroxy-2-phenyl-2,3-dihydro-1,5-benzothiazepin-4(5H)-one 3-oxidanyl-2-phenyl-3,5-dihydro-2H-1,5-benzothiazepin-4-one SMR000028182 | cid_3242458
TypeSmall organic molecule
Emp. Form.C15H13NO2S
Mol. Mass.271.334
SMILESOC1C(Sc2ccccc2NC1=O)c1ccccc1