Reaction Details
TargetDual specificity protein phosphatase 6
LigandBDBM31734
Substrate/Competitorn/a
Meas. Tech.MKP-3 in vitro HTS assay
IC50 10000±n/a nM
Citation PubChem, PC MKP-3 in vitro HTS assay PubChem Bioassay(2009)[AID]
 
Dual specificity protein phosphatase 6
Name:Dual specificity protein phosphatase 6
Type:Enzyme
Mol. Mass.:42303.19
Organism:Rattus norvegicus
Description:gi_16758752
Residue:381
BDBM31734
NameBDBM31734
Synonyms:8-carbethoxy-3a,4,5,9b-tetrahydro-3H-cyclopenta[c]quinoline-4-carboxylic acid MLS-0025126.0001 cid_2859888
TypeSmall organic molecule
Emp. Form.C16H17NO4
Mol. Mass.287.3105
SMILESCCOC(=O)c1ccc2NC(C3CC=CC3c2c1)C(O)=O