Reaction Details
TargetDual specificity protein phosphatase 6
LigandBDBM51767
Substrate/Competitorn/a
Meas. Tech.MKP-3 in vitro HTS assay
IC50 24300±n/a nM
Citation PubChem, PC MKP-3 in vitro HTS assay PubChem Bioassay(2009)[AID]
 
Dual specificity protein phosphatase 6
Name:Dual specificity protein phosphatase 6
Type:Enzyme
Mol. Mass.:42303.19
Organism:Rattus norvegicus
Description:gi_16758752
Residue:381
BDBM51767
NameBDBM51767
Synonyms:2-[(4-methyl-2-quinolyl)thio]-N-[5-(p-tolyl)-1,2,4-thiadiazol-3-yl]acetamide N-[5-(4-methylphenyl)-1,2,4-thiadiazol-3-yl]-2-(4-methylquinolin-2-yl)sulfanyl-ethanamide N-[5-(4-methylphenyl)-1,2,4-thiadiazol-3-yl]-2-[(4-methyl-2-quinolinyl)thio]acetamide SMR000208666 | cid_4256434
TypeSmall organic molecule
Emp. Form.C21H18N4OS2
Mol. Mass.406.524
SMILESCc1ccc(cc1)-c1nc(NC(=O)CSc2cc(C)c3ccccc3n2)ns1