Reaction Details
TargetDual specificity protein phosphatase 6
LigandBDBM51781
Substrate/Competitorn/a
Meas. Tech.MKP-3 in vitro HTS assay
IC50 1360±n/a nM
Citation PubChem, PC MKP-3 in vitro HTS assay PubChem Bioassay(2009)[AID]
 
Dual specificity protein phosphatase 6
Name:Dual specificity protein phosphatase 6
Type:Enzyme
Mol. Mass.:42303.19
Organism:Rattus norvegicus
Description:gi_16758752
Residue:381
BDBM51781
NameBDBM51781
Synonyms:(5E)-1-(4-fluorophenyl)-5-(2-furanylmethylidene)-2-sulfanylidene-1,3-diazinane-4,6-dione (5E)-1-(4-fluorophenyl)-5-(furan-2-ylmethylidene)-2-sulfanylidene-1,3-diazinane-4,6-dione MLS001211808 cid_777365
TypeSmall organic molecule
Emp. Form.C15H9FN2O3S
Mol. Mass.316.307
SMILESFc1ccc(cc1)N1C(=S)NC(=O)C(=Cc2ccco2)C1=O