Reaction Details
TargetTyrosine-protein phosphatase non-receptor type 7
LigandBDBM31734
Substrate/Competitorn/a
Meas. Tech.HTS Discovery of Chemical Inhibitors of HePTP, a Leukemia Target
IC50 280±n/a nM
Citation PubChem, PC HTS Discovery of Chemical Inhibitors of HePTP, a Leukemia Target PubChem Bioassay(2008)[AID]
 
Tyrosine-protein phosphatase non-receptor type 7
Name:Tyrosine-protein phosphatase non-receptor type 7
Type:Protein
Mol. Mass.:40530.79
Organism:Homo sapiens (Human)
Description:P35236
Residue:360
BDBM31734
NameBDBM31734
Synonyms:8-carbethoxy-3a,4,5,9b-tetrahydro-3H-cyclopenta[c]quinoline-4-carboxylic acid MLS-0025126.0001 cid_2859888
TypeSmall organic molecule
Emp. Form.C16H17NO4
Mol. Mass.287.3105
SMILESCCOC(=O)c1ccc2NC(C3CC=CC3c2c1)C(O)=O