Reaction Details
TargetHeat shock cognate 71 kDa protein
LigandBDBM31689
Substrate/Competitorn/a
Meas. Tech.High Throughput Screening Assay for Hsc70 Inhibitors
IC50 999000±n/a nM
Citation PubChem, PC High Throughput Screening Assay for Hsc70 Inhibitors PubChem Bioassay(2007)[AID]
 
Heat shock cognate 71 kDa protein
Name:Heat shock cognate 71 kDa protein
Type:Enzyme Catalytic Domain
Mol. Mass.:70887.67
Organism:Homo sapiens (Human)
Description:gi_5729877
Residue:646
BDBM31689
NameBDBM31689
Synonyms:1'-acetyl-6-amino-3-methyl-5-spiro[2H-pyrano[2,3-c]pyrazole-4,4'-piperidine]carbonitrile 1'-acetyl-6-amino-3-methylspiro[2H-pyrano[2,3-c]pyrazole-4,4'-piperidine]-5-carbonitrile MLS000034955 cid_645612
TypeSmall organic molecule
Emp. Form.C14H17N5O2
Mol. Mass.287.3171
SMILESCC(=O)N1CCC2(CC1)C(C#N)C(=N)Oc1n[nH]c(C)c21