Reaction Details
TargetHeat shock cognate 71 kDa protein
LigandBDBM31695
Substrate/Competitorn/a
Meas. Tech.High Throughput Screening Assay for Hsc70 Inhibitors
IC50 999000±n/a nM
Citation PubChem, PC High Throughput Screening Assay for Hsc70 Inhibitors PubChem Bioassay(2007)[AID]
 
Heat shock cognate 71 kDa protein
Name:Heat shock cognate 71 kDa protein
Type:Enzyme Catalytic Domain
Mol. Mass.:70887.67
Organism:Homo sapiens (Human)
Description:gi_5729877
Residue:646
BDBM31695
NameBDBM31695
Synonyms:2-cyano-2-(3-pyrrolidinoquinoxalin-2-yl)acetic acid allyl ester MLS000078749 cid_660535 prop-2-enyl 2-cyano-2-(3-pyrrolidin-1-ylquinoxalin-2-yl)ethanoate
TypeSmall organic molecule
Emp. Form.C18H18N4O2
Mol. Mass.322.3611
SMILESC=CCOC(=O)C(C#N)c1nc2ccccc2nc1N1CCCC1