Reaction Details
TargetHeat shock cognate 71 kDa protein
LigandBDBM31700
Substrate/Competitorn/a
Meas. Tech.High Throughput Screening Assay for Hsc70 Inhibitors
IC50 999000±n/a nM
Citation PubChem, PC High Throughput Screening Assay for Hsc70 Inhibitors PubChem Bioassay(2007)[AID]
 
Heat shock cognate 71 kDa protein
Name:Heat shock cognate 71 kDa protein
Type:Enzyme Catalytic Domain
Mol. Mass.:70887.67
Organism:Homo sapiens (Human)
Description:gi_5729877
Residue:646
BDBM31700
NameBDBM31700
Synonyms:(5Z)-5-(5-bromo-2-methoxybenzylidene)-2-(2-furyl)[1,3]thiazolo[3,2-b][1,2,4]triazol-6(5H)-one 5-[(5-bromanyl-2-methoxy-phenyl)methylidene]-2-(furan-2-yl)-[1,3]thiazolo[3,2-b][1,2,4]triazol-6-one 5-[(5-bromo-2-methoxyphenyl)methylidene]-2-(furan-2-yl)-[1,3]thiazolo[3,2-b][1,2,4]triazol-6-one SMR000020576 | cid_3236807
TypeSmall organic molecule
Emp. Form.C16H10BrN3O3S
Mol. Mass.404.238
SMILESCOc1ccc(Br)cc1C=c1sc2nc(nn2c1=O)-c1ccco1