Reaction Details
TargetHeat shock cognate 71 kDa protein
LigandBDBM31707
Substrate/Competitorn/a
Meas. Tech.High Throughput Screening Assay for Hsc70 Inhibitors
IC50 999000±n/a nM
Citation PubChem, PC High Throughput Screening Assay for Hsc70 Inhibitors PubChem Bioassay(2007)[AID]
 
Heat shock cognate 71 kDa protein
Name:Heat shock cognate 71 kDa protein
Type:Enzyme Catalytic Domain
Mol. Mass.:70887.67
Organism:Homo sapiens (Human)
Description:gi_5729877
Residue:646
BDBM31707
NameBDBM31707
Synonyms:MLS000114707 cid_5307431
TypeSmall organic molecule
Emp. Form.C20H18N2O2
Mol. Mass.318.3691
SMILES[H]C12CC([H])(C=C1)C1(C)C2C(=O)N(C1=O)c1cccc2c(C)ccnc12