Reaction Details
TargetHeat shock cognate 71 kDa protein
LigandBDBM31709
Substrate/Competitorn/a
Meas. Tech.High Throughput Screening Assay for Hsc70 Inhibitors
IC50 999000±n/a nM
Citation PubChem, PC High Throughput Screening Assay for Hsc70 Inhibitors PubChem Bioassay(2007)[AID]
 
Heat shock cognate 71 kDa protein
Name:Heat shock cognate 71 kDa protein
Type:Enzyme Catalytic Domain
Mol. Mass.:70887.67
Organism:Homo sapiens (Human)
Description:gi_5729877
Residue:646
BDBM31709
NameBDBM31709
Synonyms:4-amino-2-phenyl-isoindoline-1,3-quinone 4-azanyl-2-phenyl-isoindole-1,3-dione MLS000104009 cid_3448473
TypeSmall organic molecule
Emp. Form.C14H10N2O2
Mol. Mass.238.2414
SMILESNc1cccc2C(=O)N(C(=O)c12)c1ccccc1