Reaction Details
TargetHeat shock cognate 71 kDa protein
LigandBDBM31715
Substrate/Competitorn/a
Meas. Tech.High Throughput Screening Assay for Hsc70 Inhibitors
IC50 999000±n/a nM
Citation PubChem, PC High Throughput Screening Assay for Hsc70 Inhibitors PubChem Bioassay(2007)[AID]
 
Heat shock cognate 71 kDa protein
Name:Heat shock cognate 71 kDa protein
Type:Enzyme Catalytic Domain
Mol. Mass.:70887.67
Organism:Homo sapiens (Human)
Description:gi_5729877
Residue:646
BDBM31715
NameBDBM31715
Synonyms:3-[(4Z)-4-[(E)-3-(2-furanyl)prop-2-enylidene]-3-methyl-5-oxo-1-pyrazolyl]benzoic acid 3-[(4Z)-4-[(E)-3-(furan-2-yl)prop-2-enylidene]-3-methyl-5-oxidanylidene-pyrazol-1-yl]benzoic acid 3-{4-[3-(2-furyl)-2-propenylidene]-3-methyl-5-oxo-4,5-dihydro-1H-pyrazol-1-yl}benzoic acid SMR000113614 | cid_9549698
TypeSmall organic molecule
Emp. Form.C18H14N2O4
Mol. Mass.322.3148
SMILESOC(=O)c1cccc(c1)-n1[nH]c(=C)c(=CC=Cc2ccco2)c1=O