Reaction Details
TargetMannose-6-phosphate isomerase
LigandBDBM34702
Substrate/Competitorn/a
Meas. Tech.HTS identification of compounds inhibiting phosphomannose isomerase (PMI) via a fluorescence intensity assay.
IC50 50000±n/a nM
Citation PubChem, PC HTS identification of compounds inhibiting phosphomannose isomerase (PMI) via a fluorescence intensity assay. PubChem Bioassay(2009)[AID]
 
Mannose-6-phosphate isomerase
Name:Mannose-6-phosphate isomerase
Type:PROTEIN
Mol. Mass.:46651.35
Organism:Homo sapiens (Human)
Description:ChEMBL_1448919
Residue:423
BDBM34702
NameBDBM34702
Synonyms:(4E)-2,3-dihydroxy-4-[[(4-methyl-2-methylimino-1,3-thiazol-3-yl)amino]methylidene]cyclohexa-2,5-dien-1-one (4E)-2,3-dihydroxy-4-[[(4-methyl-2-methylimino-4-thiazolin-3-yl)amino]methylene]cyclohexa-2,5-dien-1-one (4Z)-2,3-dihydroxy-4-[[(4-methyl-2-methylimino-4-thiazolin-3-yl)amino]methylene]cyclohexa-2,5-dien-1-one SMR000151701 | cid_5834362
TypeSmall organic molecule
Emp. Form.C12H13N3O3S
Mol. Mass.279.315
SMILESCN=c1scc(C)n1N=Cc1ccc(O)c(O)c1O