Reaction Details
TargetNucleotide-binding oligomerization domain-containing protein 2
LigandBDBM48658
Substrate/Competitorn/a
Meas. Tech.uHTS luminescence assay for the identification of compounds that inhibit NOD2 in MDP treated cells
IC50 1270±n/a nM
Citation PubChem, PC uHTS luminescence assay for the identification of compounds that inhibit NOD2 in MDP treated cells PubChem Bioassay(2010)[AID]
 
Nucleotide-binding oligomerization domain-containing protein 2
Name:Nucleotide-binding oligomerization domain-containing protein 2
Type:PROTEIN
Mol. Mass.:115287.18
Organism:Homo sapiens (Human)
Description:ChEMBL_1454053
Residue:1040
BDBM48658
NameBDBM48658
Synonyms:3-amyl-7-(4-piperonylpiperazine-1-carbonyl)-1H-quinazoline-2,4-quinone 7-[4-(1,3-benzodioxol-5-ylmethyl)piperazine-1-carbonyl]-3-pentyl-1H-quinazoline-2,4-dione MLS000519909 cid_9551471
TypeSmall organic molecule
Emp. Form.C26H30N4O5
Mol. Mass.478.5402
SMILESCCCCCn1c(=O)[nH]c2cc(ccc2c1=O)C(=O)N1CCN(Cc2ccc3OCOc3c2)CC1