Reaction Details
TargetNucleotide-binding oligomerization domain-containing protein 2
LigandBDBM54261
Substrate/Competitorn/a
Meas. Tech.uHTS luminescence assay for the identification of compounds that inhibit NOD2 in MDP treated cells
IC50 1728±n/a nM
Citation PubChem, PC uHTS luminescence assay for the identification of compounds that inhibit NOD2 in MDP treated cells PubChem Bioassay(2010)[AID]
 
Nucleotide-binding oligomerization domain-containing protein 2
Name:Nucleotide-binding oligomerization domain-containing protein 2
Type:PROTEIN
Mol. Mass.:115287.18
Organism:Homo sapiens (Human)
Description:ChEMBL_1454053
Residue:1040
BDBM54261
NameBDBM54261
Synonyms:MLS000417624 N-(4-methyl-3-piperidin-1-ylsulfonylphenyl)-2-quinazolin-4-ylsulfanylacetamide N-[4-methyl-3-(1-piperidinylsulfonyl)phenyl]-2-(4-quinazolinylthio)acetamide cid_4206032
TypeSmall organic molecule
Emp. Form.C22H24N4O3S2
Mol. Mass.456.581
SMILESCc1ccc(NC(=O)CSc2ncnc3ccccc23)cc1S(=O)(=O)N1CCCCC1