Reaction Details
TargetNucleotide-binding oligomerization domain-containing protein 2
LigandBDBM50312
Substrate/Competitorn/a
Meas. Tech.uHTS luminescence assay for the identification of compounds that inhibit NOD2 in MDP treated cells
IC50 1917±n/a nM
Citation PubChem, PC uHTS luminescence assay for the identification of compounds that inhibit NOD2 in MDP treated cells PubChem Bioassay(2010)[AID]
 
Nucleotide-binding oligomerization domain-containing protein 2
Name:Nucleotide-binding oligomerization domain-containing protein 2
Type:PROTEIN
Mol. Mass.:115287.18
Organism:Homo sapiens (Human)
Description:ChEMBL_1454053
Residue:1040
BDBM50312
NameBDBM50312
Synonyms:2-[(4,6-difluoro-1,3-benzothiazol-2-yl)amino]-1,3-benzothiazole-6-carboxylic acid methyl ester SMR000236235 methyl 2-[(4,6-difluoro-1,3-benzothiazol-2-yl)amino]-1,3-benzothiazole-6-carboxylate | methyl 2-[[4,6-bis(fluoranyl)-1,3-benzothiazol-2-yl]amino]-1,3-benzothiazole-6-carboxylate
TypeSmall organic molecule
Emp. Form.C16H9F2N3O2S2
Mol. Mass.377.388
SMILESCOC(=O)c1ccc2nc(Nc3nc4c(F)cc(F)cc4s3)sc2c1