Reaction Details
TargetNucleotide-binding oligomerization domain-containing protein 2
LigandBDBM54409
Substrate/Competitorn/a
Meas. Tech.uHTS luminescence assay for the identification of compounds that inhibit NOD2 in MDP treated cells
IC50 1301±n/a nM
Citation PubChem, PC uHTS luminescence assay for the identification of compounds that inhibit NOD2 in MDP treated cells PubChem Bioassay(2010)[AID]
 
Nucleotide-binding oligomerization domain-containing protein 2
Name:Nucleotide-binding oligomerization domain-containing protein 2
Type:PROTEIN
Mol. Mass.:115287.18
Organism:Homo sapiens (Human)
Description:ChEMBL_1454053
Residue:1040
BDBM54409
NameBDBM54409
Synonyms:4-[4-(3,4-Dihydro-1H-isoquinolin-2-ylmethyl)-benzoylamino]-benzoic acid ethyl ester 4-[[[4-(3,4-dihydro-1H-isoquinolin-2-ylmethyl)phenyl]-oxomethyl]amino]benzoic acid ethyl ester MLS001209846 cid_1106361 ethyl 4-[[4-(3,4-dihydro-1H-isoquinolin-2-ylmethyl)phenyl]carbonylamino]benzoate
TypeSmall organic molecule
Emp. Form.C26H26N2O3
Mol. Mass.414.4962
SMILESCCOC(=O)c1ccc(NC(=O)c2ccc(CN3CCc4ccccc4C3)cc2)cc1