Reaction Details
TargetNucleotide-binding oligomerization domain-containing protein 2
LigandBDBM54484
Substrate/Competitorn/a
Meas. Tech.uHTS luminescence assay for the identification of compounds that inhibit NOD2 in MDP treated cells
IC50 609±n/a nM
Citation PubChem, PC uHTS luminescence assay for the identification of compounds that inhibit NOD2 in MDP treated cells PubChem Bioassay(2010)[AID]
 
Nucleotide-binding oligomerization domain-containing protein 2
Name:Nucleotide-binding oligomerization domain-containing protein 2
Type:PROTEIN
Mol. Mass.:115287.18
Organism:Homo sapiens (Human)
Description:ChEMBL_1454053
Residue:1040
BDBM54484
NameBDBM54484
Synonyms:MLS001122505 N-[1-(2,3-dimethylphenyl)-4,5,6,7-tetrahydroindazol-4-yl]-2,5-dimethyl-pyrazole-3-carboxamide SMR000665824 | cid_24791863
TypeSmall organic molecule
Emp. Form.C21H25N5O
Mol. Mass.363.4561
SMILESCc1cc(C(=O)NC2CCCc3c2cnn3-c2cccc(C)c2C)n(C)n1