Reaction Details
TargetCell division control protein 42 homolog
LigandBDBM54561
Substrate/Competitorn/a
Meas. Tech.Oxadiazole SAR compounds tested by Multiplex dose response to identify specific small molecule inhibitors of Ras and Ras-related GTPases specifically Cdc42 activated mutant
Ki 310±n/a nM
Citation PubChem, PC Oxadiazole SAR compounds tested by Multiplex dose response to identify specific small molecule inhibitors of Ras and Ras-related GTPases specifically Cdc42 activated mutant PubChem Bioassay(2009)[AID]
 
Cell division control protein 42 homolog
Name:Cell division control protein 42 homolog
Type:PROTEIN
Mol. Mass.:21258.36
Organism:Homo sapiens (Human)
Description:ChEMBL_652970
Residue:191
BDBM54561
NameBDBM54561
Synonyms:3-[3-(4-methoxyphenyl)-1,2,4-oxadiazol-5-yl]-1-[4-[2-(trifluoromethyl)phenyl]-1-piperazinyl]-1-propanone 3-[3-(4-methoxyphenyl)-1,2,4-oxadiazol-5-yl]-1-[4-[2-(trifluoromethyl)phenyl]piperazino]propan-1-one UNM-0000306082 | cid_42596909
TypeSmall organic molecule
Emp. Form.C23H23F3N4O3
Mol. Mass.460.4489
SMILESCOc1ccc(cc1)-c1noc(CCC(=O)N2CCN(CC2)c2ccccc2C(F)(F)F)n1