Reaction Details
TargetSUMO-conjugating enzyme UBC9
LigandBDBM61243
Substrate/Competitorn/a
Meas. Tech.AlphaScreen confirmatory assay for validation of inhibitors of SUMOylation
IC50 3610±n/a nM
Citation PubChem, PC AlphaScreen confirmatory assay for validation of inhibitors of SUMOylation PubChem Bioassay(2010)[AID]
 
SUMO-conjugating enzyme UBC9
Name:SUMO-conjugating enzyme UBC9
Type:Enzyme Catalytic Domain
Mol. Mass.:18011.66
Organism:Homo sapiens (Human)
Description:gi_4507785
Residue:158
BDBM61243
NameBDBM61243
Synonyms:3-[[(E)-3-[4-(4-chlorobenzyl)oxy-3-methoxy-phenyl]-2-cyano-acryloyl]amino]benzoic acid 3-[[(E)-3-[4-[(4-chlorophenyl)methoxy]-3-methoxyphenyl]-2-cyano-1-oxoprop-2-enyl]amino]benzoic acid MLS001172702 cid_1516221
TypeSmall organic molecule
Emp. Form.C25H19ClN2O5
Mol. Mass.462.882
SMILESCOc1cc(\C=C(/C#N)C(=O)Nc2cccc(c2)C(O)=O)ccc1OCc1ccc(Cl)cc1