Reaction Details
TargetCell division control protein 42 homolog
LigandBDBM54605
Substrate/Competitorn/a
Meas. Tech.Pyrazoline SAR compounds tested via Multiplex dose response to identify specific small molecule inhibitors of Ras and Ras-related GTPases specifically Cdc42 wildtype protein
Ki 50±n/a nM
Citation PubChem, PC Pyrazoline SAR compounds tested via Multiplex dose response to identify specific small molecule inhibitors of Ras and Ras-related GTPases specifically Cdc42 wildtype protein PubChem Bioassay(2009)[AID]
 
Cell division control protein 42 homolog
Name:Cell division control protein 42 homolog
Type:PROTEIN
Mol. Mass.:21258.36
Organism:Homo sapiens (Human)
Description:ChEMBL_652970
Residue:191
BDBM54605
NameBDBM54605
Synonyms:1-[4-(difluoromethylsulfonyl)phenyl]-3,5-diphenyl-2-pyrazoline 2-[4-[bis(fluoranyl)methylsulfonyl]phenyl]-3,5-diphenyl-3,4-dihydropyrazole cid_2857552
TypeSmall organic molecule
Emp. Form.C22H18F2N2O2S
Mol. Mass.412.452
SMILESFC(F)S(=O)(=O)c1ccc(cc1)N1N=C(CC1c1ccccc1)c1ccccc1