Reaction Details
TargetRas-related C3 botulinum toxin substrate 1
LigandBDBM54570
Substrate/Competitorn/a
Meas. Tech.Oxadiazole SAR compounds tested via Multiplex dose response to identify specific small molecule inhibitors of Ras and Ras-related GTPases specifically Rac1 wildtype
Ki 50±n/a nM
Citation PubChem, PC Oxadiazole SAR compounds tested via Multiplex dose response to identify specific small molecule inhibitors of Ras and Ras-related GTPases specifically Rac1 wildtype PubChem Bioassay(2009)[AID]
 
Ras-related C3 botulinum toxin substrate 1
Name:Ras-related C3 botulinum toxin substrate 1
Type:PROTEIN
Mol. Mass.:21455.91
Organism:Mus musculus
Description:EBI_101485
Residue:192
BDBM54570
NameBDBM54570
Synonyms:3-[3-(4-methoxyphenyl)-1,2,4-oxadiazol-5-yl]-1-[4-(4-methoxyphenyl)-1-piperazinyl]-1-propanone 3-[3-(4-methoxyphenyl)-1,2,4-oxadiazol-5-yl]-1-[4-(4-methoxyphenyl)piperazino]propan-1-one UNM-0000306114 | cid_20851547
TypeSmall organic molecule
Emp. Form.C23H26N4O4
Mol. Mass.422.4769
SMILESCOc1ccc(cc1)N1CCN(CC1)C(=O)CCc1nc(no1)-c1ccc(OC)cc1