Reaction Details
TargetCell division control protein 42 homolog
LigandBDBM54584
Substrate/Competitorn/a
Meas. Tech.Oxadiazole SAR compounds tested via Multiplex dose response to identify specific small molecule inhibitors of Ras and Ras-related GTPases specifically Cdc42 wildtype
Ki 300±n/a nM
Citation PubChem, PC Oxadiazole SAR compounds tested via Multiplex dose response to identify specific small molecule inhibitors of Ras and Ras-related GTPases specifically Cdc42 wildtype PubChem Bioassay(2009)[AID]
 
Cell division control protein 42 homolog
Name:Cell division control protein 42 homolog
Type:PROTEIN
Mol. Mass.:21258.36
Organism:Homo sapiens (Human)
Description:ChEMBL_652970
Residue:191
BDBM54584
NameBDBM54584
Synonyms:1-[4-(2,5-dimethylphenyl)-1-piperidinyl]-3-[3-(4-methoxyphenyl)-1,2,4-oxadiazol-5-yl]-1-propanone 1-[4-(2,5-dimethylphenyl)piperidino]-3-[3-(4-methoxyphenyl)-1,2,4-oxadiazol-5-yl]propan-1-one UNM-0000306151 | cid_44143707
TypeSmall organic molecule
Emp. Form.C25H29N3O3
Mol. Mass.419.5161
SMILESCOc1ccc(cc1)-c1noc(CCC(=O)N2CCC(CC2)c2cc(C)ccc2C)n1