Reaction Details
TargetRas-related C3 botulinum toxin substrate 1
LigandBDBM50110164
Substrate/Competitorn/a
Meas. Tech.Additional SAR compounds tested via Multiplex dose response to identify specific small molecule inhibitors of Ras and Ras-related GTPases specifically Rac1 wildtype
Ki 5110±n/a nM
Citation PubChem, PC Additional SAR compounds tested via Multiplex dose response to identify specific small molecule inhibitors of Ras and Ras-related GTPases specifically Rac1 wildtype PubChem Bioassay(2009)[AID]
 
Ras-related C3 botulinum toxin substrate 1
Name:Ras-related C3 botulinum toxin substrate 1
Type:PROTEIN
Mol. Mass.:21455.91
Organism:Mus musculus
Description:EBI_101485
Residue:192
BDBM50110164
NameBDBM50110164
Synonyms:(Z)-2-(3-(4-(methylthio)benzylidene)-6-fluoro-2-methyl-3H-inden-1-yl)acetic acid CHEMBL18797 Sulindac sulphide cid_5352624 {6-Fluoro-2-methyl-3-[1-[4-(methyl-lambda*4*-sulfanyl)-phenyl]-meth-(E)-ylidene]-3H-inden-1-yl}-acetic acid
TypeSmall organic molecule
Emp. Form.C20H17FO2S
Mol. Mass.340.411
SMILESCSc1ccc(\C=C2\C(C)=C(CC(O)=O)c3cc(F)ccc23)cc1