Reaction Details
TargetGTPase KRas [1-37]
LigandBDBM50022271
Substrate/Competitorn/a
Meas. Tech.Additional SAR compounds tested via Multiplex dose response to identify specific small molecule inhibitors of Ras and Ras-related GTPases specifically Ras activated mutant
Ki 30±n/a nM
CommentsExtracted from aid = 2043 and tid = 3
Citation PubChem, PC Additional SAR compounds tested via Multiplex dose response to identify specific small molecule inhibitors of Ras and Ras-related GTPases specifically Ras activated mutant PubChem Bioassay(2009)[AID]
 
GTPase KRas [1-37]
Name:GTPase KRas [1-37]
Synonyms:ras protein
Type:Enzyme Catalytic Domain
Mol. Mass.:4034.04
Organism:Homo sapiens (Human)
Description:gi_190938
Residue:37
BDBM50022271
NameBDBM50022271
TypeSmall organic molecule
Emp. Form.C16H14O3
Mol. Mass.254.2806
SMILESCC(C(O)=O)c1cccc(c1)C(=O)c1ccccc1