Reaction Details
TargetGTPase KRas [1-37]
LigandBDBM54595
Substrate/Competitorn/a
Meas. Tech.Pyrazoline SAR compounds tested via Multiplex dose response to identify specific small molecule inhibitors of Ras and Ras-related GTPases specifically Ras activated mutant
Ki 240±n/a nM
Citation PubChem, PC Pyrazoline SAR compounds tested via Multiplex dose response to identify specific small molecule inhibitors of Ras and Ras-related GTPases specifically Ras activated mutant PubChem Bioassay(2009)[AID]
 
GTPase KRas [1-37]
Name:GTPase KRas [1-37]
Synonyms:ras protein
Type:Enzyme Catalytic Domain
Mol. Mass.:4034.04
Organism:Homo sapiens (Human)
Description:gi_190938
Residue:37
BDBM54595
NameBDBM54595
TypeSmall organic molecule
Emp. Form.C22H19ClN2O
Mol. Mass.362.852
SMILESCOc1ccc(cc1)C1=NN(C(C1)c1ccc(Cl)cc1)c1ccccc1