Reaction Details
TargetRas-related C3 botulinum toxin substrate 1
LigandBDBM54571
Substrate/Competitorn/a
Meas. Tech.Oxadiazole SAR compounds tested via Multiplex dose response to identify specific small molecule inhibitors of Ras and Ras-related GTPases specifically Rac1 activated mutant
Ki 80±n/a nM
Citation PubChem, PC Oxadiazole SAR compounds tested via Multiplex dose response to identify specific small molecule inhibitors of Ras and Ras-related GTPases specifically Rac1 activated mutant PubChem Bioassay(2009)[AID]
 
Ras-related C3 botulinum toxin substrate 1
Name:Ras-related C3 botulinum toxin substrate 1
Type:PROTEIN
Mol. Mass.:21455.91
Organism:Mus musculus
Description:EBI_101485
Residue:192
BDBM54571
NameBDBM54571
Synonyms:1-[4-(4-fluorophenyl)-1-piperazinyl]-3-[3-(4-methoxyphenyl)-1,2,4-oxadiazol-5-yl]-1-propanone 1-[4-(4-fluorophenyl)piperazino]-3-[3-(4-methoxyphenyl)-1,2,4-oxadiazol-5-yl]propan-1-one UNM-0000306115 | cid_42628041
TypeSmall organic molecule
Emp. Form.C22H23FN4O3
Mol. Mass.410.4414
SMILESCOc1ccc(cc1)-c1noc(CCC(=O)N2CCN(CC2)c2ccc(F)cc2)n1