Reaction Details
TargetGTPase KRas [1-37]
LigandBDBM54542
Substrate/Competitorn/a
Meas. Tech.Oxadiazole SAR compounds tested via Multiplex dose response to identify specific small molecule inhibitors of Ras and Ras-related GTPases specifically Ras wildtype
Ki 270±n/a nM
Citation PubChem, PC Oxadiazole SAR compounds tested via Multiplex dose response to identify specific small molecule inhibitors of Ras and Ras-related GTPases specifically Ras wildtype PubChem Bioassay(2009)[AID]
 
GTPase KRas [1-37]
Name:GTPase KRas [1-37]
Synonyms:ras protein
Type:Enzyme Catalytic Domain
Mol. Mass.:4034.04
Organism:Homo sapiens (Human)
Description:gi_190938
Residue:37
BDBM54542
NameBDBM54542
TypeSmall organic molecule
Emp. Form.C24H28N4O3
Mol. Mass.420.5041
SMILESCOc1ccc(cc1)-c1noc(CCC(=O)N2CCN(CC2)c2cc(C)ccc2C)n1