Reaction Details
TargetGTPase KRas [1-37]
LigandBDBM54547
Substrate/Competitorn/a
Meas. Tech.Oxadiazole SAR compounds tested via Multiplex dose response to identify specific small molecule inhibitors of Ras and Ras-related GTPases specifically Ras wildtype
Ki 290±n/a nM
Citation PubChem, PC Oxadiazole SAR compounds tested via Multiplex dose response to identify specific small molecule inhibitors of Ras and Ras-related GTPases specifically Ras wildtype PubChem Bioassay(2009)[AID]
 
GTPase KRas [1-37]
Name:GTPase KRas [1-37]
Synonyms:ras protein
Type:Enzyme Catalytic Domain
Mol. Mass.:4034.04
Organism:Homo sapiens (Human)
Description:gi_190938
Residue:37
BDBM54547
NameBDBM54547
TypeSmall organic molecule
Emp. Form.C22H23ClN4O3
Mol. Mass.426.896
SMILESCOc1ccc(cc1)-c1noc(CCC(=O)N2CCN(CC2)c2ccccc2Cl)n1