Reaction Details
Target4-hydroxy-2-oxoglutarate aldolase, mitochondrial
LigandBDBM267947
Substrate/Competitorn/a
Meas. Tech.Fluorescence based hOGA assay
pH7±n/a
Temperature298.15±n/a K
Ki 0.600±n/a nM
Commentsextracted
Citation Kaul, RMcEachern, EJVocadlo, DJZhou, YLiu, KSelnick, HGWei, ZMu, CWang, YWang, X Selective glycosidase inhibitors and uses thereof US Patent US9718854 Publication Date 8/1/2017
 
4-hydroxy-2-oxoglutarate aldolase, mitochondrial
Name:4-hydroxy-2-oxoglutarate aldolase, mitochondrial
Type:PROTEIN
Mol. Mass.:35253.21
Organism:Homo sapiens (Human)
Description:ChEMBL_461876
Residue:327
BDBM267947
NameBDBM267947
Synonyms:(3aR,5R,6S,7R,7aR)-5- ((cyclopentylamino)methyl)-2- (methylamino)-5,6,7,7a-tetrahydro- 3aH-pyrano[3,2-d]thiazole-6,7-diol | US9718854, 37
TypeSmall organic molecule
Emp. Form.C13H23N3O3S
Mol. Mass.301.405
SMILESCNC1=N[C@H]2[C@H](O[C@H](CNC3CCCC3)[C@@H](O)[C@@H]2O)S1