Reaction Details
TargetTyrosine-protein phosphatase non-receptor type 7
LigandBDBM44469
Substrate/Competitorn/a
Meas. Tech.MOA HePTP Fluorescent secondary assay for identification of redox-state modulating compounds
IC50 1050±n/a nM
Citation PubChem, PC MOA HePTP Fluorescent secondary assay for identification of redox-state modulating compounds PubChem Bioassay(2009)[AID]
 
Tyrosine-protein phosphatase non-receptor type 7
Name:Tyrosine-protein phosphatase non-receptor type 7
Type:Protein
Mol. Mass.:40530.79
Organism:Homo sapiens (Human)
Description:P35236
Residue:360
BDBM44469
NameBDBM44469
Synonyms:2,3-bis(2-furanyl)-N-(2-phenylethyl)-6-quinoxalinecarboxamide 2,3-bis(furan-2-yl)-N-(2-phenylethyl)quinoxaline-6-carboxamide SMR000131061 | cid_5076888
TypeSmall organic molecule
Emp. Form.C25H19N3O3
Mol. Mass.409.4367
SMILESO=C(NCCc1ccccc1)c1ccc2nc(-c3ccco3)c(nc2c1)-c1ccco1