Reaction Details
TargetTyrosine-protein phosphatase non-receptor type 7
LigandBDBM46189
Substrate/Competitorn/a
Meas. Tech.MOA HePTP Fluorescent secondary assay for identification of redox-state modulating compounds
IC50 198±n/a nM
Citation PubChem, PC MOA HePTP Fluorescent secondary assay for identification of redox-state modulating compounds PubChem Bioassay(2009)[AID]
 
Tyrosine-protein phosphatase non-receptor type 7
Name:Tyrosine-protein phosphatase non-receptor type 7
Type:Protein
Mol. Mass.:40530.79
Organism:Homo sapiens (Human)
Description:P35236
Residue:360
BDBM46189
NameBDBM46189
Synonyms:1-[2,3-bis(2-furanyl)-6-quinoxalinyl]-3-(2-methoxyethyl)urea 1-[2,3-bis(furan-2-yl)quinoxalin-6-yl]-3-(2-methoxyethyl)urea cid_3157647
TypeSmall organic molecule
Emp. Form.C20H18N4O4
Mol. Mass.378.3813
SMILESCOCCNC(=O)Nc1ccc2nc(-c3ccco3)c(nc2c1)-c1ccco1