Reaction Details
TargetTyrosine-protein phosphatase non-receptor type 7
LigandBDBM46207
Substrate/Competitorn/a
Meas. Tech.MOA HePTP Fluorescent secondary assay for identification of redox-state modulating compounds
IC50 227±n/a nM
Citation PubChem, PC MOA HePTP Fluorescent secondary assay for identification of redox-state modulating compounds PubChem Bioassay(2009)[AID]
 
Tyrosine-protein phosphatase non-receptor type 7
Name:Tyrosine-protein phosphatase non-receptor type 7
Type:Protein
Mol. Mass.:40530.79
Organism:Homo sapiens (Human)
Description:P35236
Residue:360
BDBM46207
NameBDBM46207
Synonyms:4-[[5-(4-bromophenyl)-2-furoyl]thiocarbamoylamino]benzoic acid 4-[[5-(4-bromophenyl)furan-2-yl]carbonylcarbamothioylamino]benzoic acid MLS-0383777.0001 | cid_1328767
TypeSmall organic molecule
Emp. Form.C19H13BrN2O4S
Mol. Mass.445.287
SMILESOC(=O)c1ccc(NC(=S)NC(=O)c2ccc(o2)-c2ccc(Br)cc2)cc1