Reaction Details
TargetTyrosine-protein phosphatase non-receptor type 7
LigandBDBM46217
Substrate/Competitorn/a
Meas. Tech.MOA HePTP Fluorescent secondary assay for identification of redox-state modulating compounds
IC50 30200±n/a nM
Citation PubChem, PC MOA HePTP Fluorescent secondary assay for identification of redox-state modulating compounds PubChem Bioassay(2009)[AID]
 
Tyrosine-protein phosphatase non-receptor type 7
Name:Tyrosine-protein phosphatase non-receptor type 7
Type:Protein
Mol. Mass.:40530.79
Organism:Homo sapiens (Human)
Description:P35236
Residue:360
BDBM46217
NameBDBM46217
Synonyms:2-(2-dibenzothiophenyloxy)-2-methylpropanoic acid 2-dibenzothiophen-2-yloxy-2-methyl-propionic acid MLS-0412044.0001 | cid_901652
TypeSmall organic molecule
Emp. Form.C16H14O3S
Mol. Mass.286.346
SMILESCC(C)(Oc1ccc2sc3ccccc3c2c1)C(O)=O