Reaction Details
TargetTyrosine-protein phosphatase non-receptor type 7
LigandBDBM46272
Substrate/Competitorn/a
Meas. Tech.MOA HePTP Fluorescent secondary assay for identification of redox-state modulating compounds
IC50 6030±n/a nM
Citation PubChem, PC MOA HePTP Fluorescent secondary assay for identification of redox-state modulating compounds PubChem Bioassay(2009)[AID]
 
Tyrosine-protein phosphatase non-receptor type 7
Name:Tyrosine-protein phosphatase non-receptor type 7
Type:Protein
Mol. Mass.:40530.79
Organism:Homo sapiens (Human)
Description:P35236
Residue:360
BDBM46272
NameBDBM46272
Synonyms:2-[2-ethoxy-6-iodanyl-4-[(E)-(4-oxidanylidene-2-phenylazanyl-1,3-thiazol-5-ylidene)methyl]phenoxy]ethanoic acid 2-[4-[(E)-(2-anilino-4-oxo-1,3-thiazol-5-ylidene)methyl]-2-ethoxy-6-iodophenoxy]acetic acid MLS-0425587.0001 | cid_1756795
TypeSmall organic molecule
Emp. Form.C20H17IN2O5S
Mol. Mass.524.329
SMILESCCOc1cc(C=C2SC(Nc3ccccc3)=NC2=O)cc(I)c1OCC(O)=O