Reaction Details
TargetBcl-2-related protein A1
LigandBDBM30741
Substrate/Competitorn/a
Meas. Tech.Confirmation dose response of hits from multiplexed high-throughput screen for small molecule regulators of Bcl-2 family protein interactions, specifically Bim-Bfl-1
EC50 4920±n/a nM
Citation PubChem, PC Confirmation dose response of hits from multiplexed high-throughput screen for small molecule regulators of Bcl-2 family protein interactions, specifically Bim-Bfl-1 PubChem Bioassay(2009)[AID]
 
Bcl-2-related protein A1
Name:Bcl-2-related protein A1
Type:Apoptosis regulator protein
Mol. Mass.:20130.01
Organism:Homo sapiens (Human)
Description:n/a
Residue:175
BDBM30741
NameBDBM30741
Synonyms:2-amino-6-(4-chlorophenyl)-4-(5-methyl-3-furanyl)-3-pyridinecarbonitrile 2-amino-6-(4-chlorophenyl)-4-(5-methylfuran-3-yl)pyridine-3-carbonitrile MLS000036685 cid_660120
TypeSmall organic molecule
Emp. Form.C17H12ClN3O
Mol. Mass.309.75
SMILESCc1cc(co1)-c1cc(nc(N)c1C#N)-c1ccc(Cl)cc1