Reaction Details
TargetKappa-type opioid receptor
LigandBDBM33108
Substrate/Competitorn/a
Meas. Tech.HTS Image-Based Screen for Selective Antagonists of the KOR Receptor
IC50 17080±3020 nM
Citation PubChem, PC HTS Image-Based Screen for Selective Antagonists of the KOR Receptor PubChem Bioassay(2009)[AID]
 
Kappa-type opioid receptor
Name:Kappa-type opioid receptor
Type:G Protein-Coupled Receptor (GPCR)
Mol. Mass.:42648.76
Organism:Homo sapiens (Human)
Description:P41145
Residue:380
BDBM33108
NameBDBM33108
Synonyms:2-[[7-(1H-benzimidazol-2-ylsulfanyl)-4-nitro-2,1,3-benzoxadiazol-5-yl]amino]ethyl acetate 2-{[7-(1H-benzimidazol-2-ylthio)-4-nitro-2,1,3-benzoxadiazol-5-yl]amino}ethyl acetate SMR000207009 acetic acid 2-[[7-(1H-benzimidazol-2-ylthio)-4-nitro-benzofurazan-5-yl]amino]ethyl ester | cid_12004519
TypeSmall organic molecule
Emp. Form.C17H14N6O5S
Mol. Mass.414.395
SMILESCC(=O)OCCNc1cc(Sc2nc3ccccc3[nH]2)c2nonc2c1[N+]([O-])=O