Reaction Details
TargetTyrosine-protein phosphatase non-receptor type 22
LigandBDBM46245
Substrate/Competitorn/a
Meas. Tech.SAR LYP1 Fluorescent Assay using OMFP substrate for In Vitro dose response studies
IC50 50909±n/a nM
Citation PubChem, PC SAR LYP1 Fluorescent Assay using OMFP substrate for In Vitro dose response studies PubChem Bioassay(2009)[AID]
 
Tyrosine-protein phosphatase non-receptor type 22
Name:Tyrosine-protein phosphatase non-receptor type 22
Type:n/a
Mol. Mass.:91712.31
Organism:Homo sapiens (Human)
Description:Q9Y2R2
Residue:807
BDBM46245
NameBDBM46245
Synonyms:4-keto-5-methyl-2-[(E)-2-(4-methyl-3-nitro-phenyl)vinyl]-3H-thieno[2,3-d]pyrimidine-6-carboxylic acid 5-methyl-2-[(E)-2-(4-methyl-3-nitrophenyl)ethenyl]-4-oxo-3H-thieno[2,3-d]pyrimidine-6-carboxylic acid cid_8853383
TypeSmall organic molecule
Emp. Form.C17H13N3O5S
Mol. Mass.371.367
SMILESCc1c(sc2nc(C=Cc3ccc(C)c(c3)[N+]([O-])=O)[nH]c(=O)c12)C(O)=O