Reaction Details
TargetSerine/threonine-protein kinase ATR
LigandBDBM267994
Substrate/Competitorn/a
Meas. Tech.Time-Resolved Fluorescence Energy Transfer (TR-FRET Tracer B)
pH7±n/a
IC50 6.36±n/a nM
Commentsextracted
Citation Wortmann, LLücking, ULefranc, JBriem, HVon Nussbaum, FBader, BSiemeister, GBone, WLienau, PMoosmayer, DEberspächer, USchick, HEis, KKoppitz, MWengner, AMGrudzinska-Goebel, J 2-(morpholin-4-yl)-1,7-naphthyridines US Patent US9549932 Publication Date 1/24/2017
 
Serine/threonine-protein kinase ATR
Name:Serine/threonine-protein kinase ATR
Type:Protein
Mol. Mass.:301404.58
Organism:Homo sapiens (Human)
Description:Q13535
Residue:2644
BDBM267994
NameBDBM267994
Synonyms:4-(4-methanesulphonylphenyl)-2-((R)-3-methylmorpholin-4-yl)-8-(2H-pyrazol-3-yl)-[1,7]naphthyridine | US9549932, 26
TypeSmall organic molecule
Emp. Form.C28H31N5O4S
Mol. Mass.533.642
SMILESC[C@@H]1COCCN1c1cc(-c2ccc(cc2)S(C)(=O)=O)c2ccnc(-c3ccnn3C3CCCCO3)c2n1